{"text_format":"1","workbook":"xlsx","n_sheets":7,"sheets":["D1.2","Sheet1","Stats","Chart detailed","Status change flow","Parameters","Values"],"not_rendered":{"charts":3,"images":1,"macros":1,"external_links":5,"defined_names":4,"comments":0,"pivot_tables":0},"unopened":[{"sheet":"Chart detailed","index":3,"reason":"not_a_worksheet"}],"bounds":{"document_bytes":16777216,"sheet_cells":100000,"rows_first":2000,"rows_last":500,"rows_between":2000,"halvings":0,"cell_chars":16384,"cell_head_chars":4096},"cells_cut":0,"cells_raw":0,"read":"whole","date_system":"1900"}

{"sheet":"D1.2","index":0,"n_rows":619,"n_cols":20,"rows_kept":619,"cut":false,"hidden":false,"merged":[]}
["Comment\nNumber","TF?/WG","Comment\nStatus","Resolution\nStatus","Commenter\nSatisfaction","Comment\nCategory","Comment\nType","Required","Page #","Clause","Sub-clause","Line #","Comment","Proposed\nChange","Commenter\nName","Commenter\nAffiliation","Commenter\nEmail","Commenter\nPhone","Comment\nResolution","Last modified on"]
[1,"TF3","Resolved","Accept","None",null,"Editorial","Yes",12,null,1,12,"States \"This specification is concerned with encapsulation and mapping only\" but this contradicts point d) on line 10 and doesn't mention de-encapsulation.\nPoint d) states ","Change to \"This specification is only concerned with point d) above, i.e. the ingress/egress mapping functions\" ",{"$f":"IF($A2<>\"\",'[1]Step 1 -- Commenter information'!$B$2,\"\")","v":"Brian Torley"},{"$f":"IF($A2<>\"\",'[1]Step 1 -- Commenter information'!$B$3,\"\")","v":"Xilinx"},null,null,"ok","2016.11.08, 08:14"]
[2,"TF3","Resolved","AIP","None",null,"Technical","Yes",12,null,1,10,"Suggests ingress/egress mapping function is encapsulation and dejitter and retiming, but line 12 says spec is concerned with encapsulation and mapping only so they are different things.\nWe need to clarify what mapping function is, i.e. does it include encapsulation, does it include dejitter and retiming, Is the spec only concerned with some aspects of the mapping function?","Clarify.\nSplit d) into more parts and on line 10 refer to the part relevant to the spec.","Brian Torley","Xilinx",null,null,"\r\n\"( Note: I have changed dejittering to de-jittering to use same format as used in Fig 5-1, but both could be changed to dejitter if prefered)\r\nChange from: \r\nd) ingress/egress mapping functions that encapsulate/de-encapsulate while dejittering and retiming the recovered signal.\r\nThis specification is concerned with encapsulation and mapping only.\r\n\r\nTO:\r\nd) ingress/egress mapping functions that encapsulate/de-encapsulate \r\ne) de-jittering buffering and retiming the recovered data.\r\nThis specification is concerned with d) and e)  only.\"\r\n\r\n// Consolidate with Kevins comment & check\r\n","2016.11.15, 07:27"]
[3,"TF3","Resolved","Accept","None",null,"Technical","Yes",11,null,1,42,"\"from between\"","Change to \"between\"","Brian Torley","Xilinx",null,null,"ok - editorial.","2016.10.27, 14:38"]
[4,"TF3","Resolved","AIP","None",null,"Technical","Yes",12,null,1.2,20,"native RoE is confusing especially when in quotes the first time it is used.\nIt should be described more clearly\n","Remove (i.e. … RoE\").\nAdd a bullet point or another paragraph to say what Native RoE is.\nI think native is a superset of the other two mappers.\nIt may be worth stating that structure aware and structure agnostic terms do not apply to Native and why there is a difference. (I was unclear about this for a while.)","Brian Torley","Xilinx",null,null,"\"Remove (i.e., the “native RoE”)\r\n\r\nAdd bullet \r\n\" - Transport Radio Fronthaul I/Q in Native RoE packet format.\"","2016.11.15, 07:35"]
[5,"TF3","Resolved","Accept","None",null,"Editorial","Yes",42,null,7.3,7,"Section title \"Native RoE data flow packet\" is not consistent with other Mapper sections.","Change to \"Native RoE mapper\".\nI think it would be better for Native mapper to be section 7.1, then others after, as it is the superset.","Brian Torley","Xilinx",null,null,"ok\r\n\r\na.b Native RoE mapper\r\na.b.c Native RoE data flow packet\r\na.b.c.d Sub type (subType) field","2016.11.08, 08:14"]
[6,"TF3","Resolved","Accept","None",null,"Technical","Yes",22,null,"4.4.1",9,"Function \"Native RoE data flow sub type\" has \"flow\" but other mapper do not.\nAlso RoE is not first word.","Rename to \"RoE native data sub type\"","Brian Torley","Xilinx",null,null,"ok - editorial.","2016.10.27, 14:38"]
[7,"TF3","Withdrawn","None","None",null,"Technical","No",null,null,null,null,"Example of Structure aware and Native (section 7.2 and 7.3) show the same mapping (fig 7.1 and fig 7.6) so don't help explain the difference between the two mapping types.","Clarify what the difference is.","Brian Torley","Xilinx",null,null,"They are different\r\n1) C-plane not present\r\n2) i/q interleaving\r\n3) bit order\r\n**************\r\nComment withdrawn on 2016.10.27, at 15:22","2016.10.27, 15:22"]
[8,"TF3","Resolved","AIP","None",null,"Technical","Yes",20,null,"4.2.2",18,"Describes structure aware and native mappers having separate control and data streams, but does not state what structure agnostic have.","Add Structure agnostic comparison e.g. there is no assocaiated control packets as the entire data dtream is encapsulated ( i..e only have a single data stream. LCd.)","Brian Torley","Xilinx",null,null,"\"Add 2nd paragraph into section 4.2.2 (between line 23 & 24)\r\nStructure agnostic mappers do not have control packets as the entire data stream is encapsulated as a single LCd data stream.\"\r\n","2016.11.15, 07:40"]
[9,"TF3","Resolved","Accept","None",null,"Technical","Yes",20,null,"4.2.2",19,"We use the term streams but use channels elsewhere","Change streams to channels","Brian Torley","Xilinx",null,null,"Change streams to channels","2016.10.27, 16:48"]
[10,"TF3","Resolved","AIP","None",null,"Technical","Yes",23,null,"4.4.4.1",14,"It is not clear why there are 3 field/counter used for sequence number, and this is the first time sequence numbers is mentioned.","Add a description or example and explanation why this is not a single field (eg as example in section 71.2.3)","Brian Torley","Xilinx",null,null,"please suggest text\r\nseqNum is mentioned in the paragraph above.\r\n\r\n\"Add to the start of section 4.4.4.1\r\n\r\nThe sequence number field is used to identify the order of successive packets.\r\nTo allow additional flexibliity it is possible to have up to two independent counters (e.g. one for HFN and another for BFN).\"\r\n\r\n","2016.11.15, 07:44"]
[11,"TF3","Resolved","AIP","None",null,"Technical","Yes",null,null,null,null,"C-Plane is mentioned 3 times but not defined.\nAre we using another term in other parts of the spec ie Control Channel, LCc?","Define first time it is used and add to definitions or change to Logical Channel Control processing.","Brian Torley","Xilinx",null,null,"\"Add C-Plane to Acronyms and abbreviations (section 3.1)\r\nC-plane     Term used in CPRI specification as the Control data flow for call processing.\"\r\n","2016.11.15, 07:46"]
[12,"TF3","Resolved","AIP","None",null,"Technical","Yes",11,null,1,37,"The value of \"no more than +/-8ns\"  gives an absolute limit. Where does this come from?\n802.1CM Class A+ is +/- 10ns.","Add source of requirement or say \"expected to be no more than ..\"","Brian Torley","Xilinx",null,null,"This comes from CPRI, who knows where they got it from....\r\nEven though this is in the Overview, I do agree that it sets overly harsh expectations. Also, its not really differential delay, its latency uncertaincy.\r\n\r\nhow about 'There are many strict requirements on the protocol such as absolute end to end delay and deterministic latency.'?","2016.10.27, 16:54"]
[13,"TF3","Resolved","AIP","None",null,"Technical","Yes",11,null,1,37,"Is differential delay mean delay between different CPRI links?\nIs this between different CPRI links in the network of on a single aggregator?","Clarify meaning","Brian Torley","Xilinx",null,null,"yes, this should be deterministic latency. See comment 12","2016.10.27, 16:54"]
[14,"TF3","Resolved","AIP","None",null,"Technical","Yes",11,null,1,43,"Are there not three encapsulation techniques including native. We should mention native mapping as that is neither of the two mentioned.","Add Native mapping ","Brian Torley","Xilinx",null,null,"please suggest text. we probably need to do this as a group as native is likely to become more expansive.\r\n\r\n\"Change \"\"There are broadly two types of encapsulation techniques\"\" to \"\"There are broadly three types of encapsulation techniques. The first is native encapsulation (which unlike the other two, does not require a CPRI Port).\r\n\r\n// Add something along these lines.\r\n\r\n\"\r\n","2016.11.15, 07:49"]
[15,"TF3","Resolved","AIP","None",null,"Editorial","Yes",15,null,3.3,18,"Field names convention is not clear as it is a continuation of Parameter definition.\nWe also use bold for eth/cpri etc which are not fields or parameters.","Make Field names sentence a separate paragraph as follows'\n\"Field name are in bold without a prexied period, for example subType\"\nExplain bold when used for an object/entity eg eth/cpri/mapper.","Brian Torley","Xilinx",null,null,"1. ok - as described\r\n   Within this document, names of Parameters are .....\r\n   Fields names are shown in bold typeface without a prexied period, for example ....  \r\n\r\n2. ok - but needs more\r\n   add item before 3.2 a). a') RoE Funtional Element. An RoE mapper/demapper, Ethernet link or CPRI port. Add the following to 3.3 'When parameters are described with their asscociated functional element, both the functional element and parameter is shown in bold typeface.  ","2016.11.08, 08:16"]
[16,"TF3","Resolved","AIP","None",null,"Editorial","Yes",null,null,null,null,"Various names used for the same thing, \nnative RoE data packet format\nnative RoE packet\nnative RoE data flow packet\nnative RoE\nnative RoE framing format",null,"Brian Torley","Xilinx",null,null,"ok. We need to select our prefered text and identify each place. \r\n\r\nUse 'native RoE packet' unless something more explicit is needed.","2016.11.08, 08:18"]
[17,"TF3","Incomplete","AIP","None",null,"Editorial","Yes",17,null,4.0999999999999996,7,"Timing control packets doesn't tie up with LCt in definitions and \"control\" in name may cause confusion with \"control packets\"","Change \"Timing control packets\" to \"Timing packets\"","Brian Torley","Xilinx",null,null,"Not sure what to do here, there's a bit more to it.\r\nThe only packet which only contains timing information is the timing packet which is a control packet. Right now the LCt is inside the LCc. We could give the timing packet it's own subType? \r\nAlso, timingInfo is inside data packets too so perhaps it would be better to change the diagram to show LCt inside both LCc and LCd?\r\nOr, we could rewrite this completely to avoid the word 'packets' in preference to 'information'","2016.11.15, 09:30"]
[18,"TF3","Proposed","Reject","None",null,"Editorial","Yes",28,null,6.6,8,"Section is called Ethernet link but  Table 6-2 Description says \"Ethernet port\".","Should Table 6-2 Description to say \"Ethernet link\"","Brian Torley","Xilinx",null,null,"Yes, for reasons lost in time we use the convention 'Ethernet Link' and 'CPRI port'","2016.11.08, 08:20"]
[19,"TF3","Resolved","Accept","None",null,"Editorial","Yes",21,null,"4.2.3",4,"Mention that a CPRI port is a Physical port (as mentioned in later sections)","As per section 4.2.1 add this sentence.\nIn this document, a CPRI port, is defined as a physical CPRI interface.","Brian Torley","Xilinx",null,null,"ok","2016.11.08, 08:20"]
[20,"TF3","Resolved","Accept","None",null,"Editorial","Yes",46,null,"8.1.8",2,"Sub-clause content is missing.","Remove the editor's note and add the following text:\n\nCtrl AxC packets use opCode=1 in the RoE control packet common frame format. The payload contains CPRI stream Ctrl_AxC control words according to the CPRI11.ctrl.axc_vsd container definition as described in sub-clause 7.2.8. The size of the extracted control word is determined by the CPRI option in use (i.e., line bit rate, see CPRI specification V7.0 Table 3). The .cwStart shall be within range from 4 to 7. The sum of .cwStart and .cwSize shall be less than 8.\nThe Ctrl AxC packet’s common RoE header flowID gets populated according to CPRI11.ctrl.axc_vsd container .flowID definition. The orderInfo field shall contain a sequence number.\n The control packet’s payload is populated in a network byte order as extracted by the “control process” (see sub-clause 7.2.3 and illustrated in CPRI specification V7.0 Figure 16). \n\n(Commenter's note: picture provided in this excel in the sheet1) ",{"$f":"IF($A21<>\"\",'[2]Step 1 -- Commenter information'!$B$2,\"\")","v":"Jouni Korhonen"},{"$f":"IF($A21<>\"\",'[2]Step 1 -- Commenter information'!$B$3,\"\")","v":"Broadcom Ltd."},null,null,"ok. Will work with Jouni to add. Comments can be addressed in the next cycle.","2016.11.08, 08:23"]
[21,"TF3","Resolved","AIP","None",null,"Editorial","Yes",46,null,"8.1.8.1",4,"Sub-clause content is missing.","Remove the editor's note and add the following text:\n\nCtrl AxC packets use opCode=2 in the RoE control packet common frame format. The payload contains CPRI stream VSD control words according to the CPRI11.ctrl.axc_vsd container definition as described in sub-clause 7.2.8. The size of the extracted control word is determined by the CPRI option in use (i.e., line bit rate, see CPRI specification V7.0 Table 3). The .cwStart shall be within range from 16 to p (the pointer p as defined in CPRI specification V7.0 sub-clause 4.2.7.4). The sum of .cwStart and .cwSize shall be less than p.\n\nThe Ctrl AxC packet’s common RoE header flowID gets populated according to CPRI11.ctrl.axc_vsd container .flowID definition. The orderInfo field shall contain a sequence number.\n\n The control packet’s payload is populated in a network byte order as extracted by the “control process” (see sub-clause 7.2.3 and illustrated in CPRI specification V7.0 Figure 16). \n\n\n(Commenter's note: picture provided in this excel in the sheet1)",{"$f":"IF($A22<>\"\",'[2]Step 1 -- Commenter information'!$B$2,\"\")","v":"Jouni Korhonen"},{"$f":"IF($A22<>\"\",'[2]Step 1 -- Commenter information'!$B$3,\"\")","v":"Broadcom Ltd."},null,null,"ok. Will work with Jouni to add. Comments can be addressed in the next cycle.","2016.11.08, 08:23"]
[22,"TF3","Resolved","Accept","None",null,"Editorial","Yes",46,null,"8.1.8.1",3,"Sub-clause numbering/level is incorrect. The sub-clause should be 8.1.9.","Renumber the sub-clause to 8.1.9.",{"$f":"IF($A23<>\"\",'[2]Step 1 -- Commenter information'!$B$2,\"\")","v":"Jouni Korhonen"},{"$f":"IF($A23<>\"\",'[2]Step 1 -- Commenter information'!$B$3,\"\")","v":"Broadcom Ltd."},null,null,"yes.","2016.11.08, 08:23"]
[23,"TF3","Resolved","Accept","None",null,"Editorial","Yes",46,null,"8.1.8.2",5,"Sub-clause numbering/level is incorrect. The sub-clause should be 8.1.10.","Renumber the sub-clause to 8.1.10.",{"$f":"IF($A24<>\"\",'[2]Step 1 -- Commenter information'!$B$2,\"\")","v":"Jouni Korhonen"},{"$f":"IF($A24<>\"\",'[2]Step 1 -- Commenter information'!$B$3,\"\")","v":"Broadcom Ltd."},null,null,"yes","2016.11.08, 08:23"]
[24,"TF3","Resolved","AIP","None",null,"Editorial","Yes",44,null,"8.1.3",17,"The text now says the orderInfo details _shall_ be per opCode. While this is true, there is no reason to have a general rule for any opCode use and use opCode specific description to override the generic handling when needed.","OLD:\nThe RoE control packet opCode specification shall describe the exact sequence number handling.\n\nNEW:\nThe RoE control packet opCode specification shall describe the exact sequence number handling unless the following generic handling is not adequate.\n\nThe .orderInfoType is set to 0 (indicates the seqNum is used). The seqNum associated orderInfo parameters listed in sub-clause 4.4.4.1 are programmed to appropriate values for each opCode by the management entity setting up the control packet connection.",{"$f":"IF($A25<>\"\",'[2]Step 1 -- Commenter information'!$B$2,\"\")","v":"Jouni Korhonen"},{"$f":"IF($A25<>\"\",'[2]Step 1 -- Commenter information'!$B$3,\"\")","v":"Broadcom Ltd."},null,null,"I'd prefer to use the same section convention we use for the non-control packets.\r\nEach opCode should have a subsection for\r\n   opCode type field \r\n   Flow identifier\r\n   Ordering information\r\n   Length\r\n   Payload\r\n\r\nThis gives us consistancy and the most flexibility.\r\n\r\n","2016.11.08, 08:26"]
[25,"TF3","Resolved","AIP","None",null,"Editorial","Yes",39,null,"7.2.8",18,"The \".cwNum\" is redundant and covered by the \".cwSize\".","Remove \".cwNum\" from the container description.",{"$f":"IF($A26<>\"\",'[2]Step 1 -- Commenter information'!$B$2,\"\")","v":"Jouni Korhonen"},{"$f":"IF($A26<>\"\",'[2]Step 1 -- Commenter information'!$B$3,\"\")","v":"Broadcom Ltd."},null,null,"ok. See comment 26 too.\r\nI notice we refer to these parameters in 7.2.8 but dont define them until much later. Move Table 7-5 to the start of 7.2.8","2016.11.08, 08:26"]
[26,"TF3","Resolved","Accept","None",null,"Technical","Yes",40,null,"7.2.8",11,"The \".cwSize\" number range is wrong. It should be from 0 to 63 (to fit into 6 bits). Also \".cwNum\" is incorrectrly referenced in this paragraph.","Propose rewriting the paragraph:\n\nThe .cwStart defines the start of sub-channel (Ns) and has the valid range from 0 to 63. The .cwSize defines the number of extracted sub-channels minus one and the valid range is from 0 to 63. The mask defined by .cwSel applies to the “area” defined by the .cwStart and .cwSize. The specific mapper definitions may have more specific restriction to the ranges. ",{"$f":"IF($A27<>\"\",'[2]Step 1 -- Commenter information'!$B$2,\"\")","v":"Jouni Korhonen"},{"$f":"IF($A27<>\"\",'[2]Step 1 -- Commenter information'!$B$3,\"\")","v":"Broadcom Ltd."},null,null,"ok. ","2016.10.27, 17:05"]
[27,"TF3","Resolved","Accept","None",null,"Editorial","Yes",41,null,"7.2.8",9,"Table 7-5 \".cwNum\" entry should be \".cwSize\" and the description needs to be updated accordingly. Also, the \".cwSel\" is used to selects sub-channels, thus the note \"Value of 0 selects/extracts no sub-channels.\" is unnecessary and does not work either because the \".cwSize\" valid number range is from 0 to 63.","Change \".cwNum\" to \".cwSize\".\n\nPropose updated Description:\nNumber of consecutive sub-channels minus one allocated for the control data. Valid range is from 0 to 63. ",{"$f":"IF($A28<>\"\",'[2]Step 1 -- Commenter information'!$B$2,\"\")","v":"Jouni Korhonen"},{"$f":"IF($A28<>\"\",'[2]Step 1 -- Commenter information'!$B$3,\"\")","v":"Broadcom Ltd."},null,null,"ok. We agreed the wording in a previous comment. Re-use the same type of text.","2016.11.08, 08:28"]
[28,"TF3","Resolved","Accept","None",null,"Editorial","Yes",33,null,"7.1.2.3",7,"Current text says: ”The 32-bit orderInfo field shall be used as a sequence number, with successive packets increasing the sequence number by 1” – which is wrong.\n\nThe baseline proposal tf3_1606_korhonen_sof_2.pdf added support for 1:2:24:5 timestamp. See tf3_1606_ballot_1904_3-1.pdf comment #45.","OLD:\nThe 32-bit orderInfo field shall be used as a sequence number, with successive packets increasing the sequence number by 1.  A gap in sequence numbers indicates a missing packet.  Packets received out of order due to network traffic may be output in order if egress buffering is used and the out of order packets are received within the window of egress buffering.\n\nNEW:\nThe orderInfo field uses either a sequence number or timestamps as described in sub-clase 4.4.4. When sequence numbers are used a gap in sequence numbers indicates a missing packet.  Packets received out of order due to network traffic may be output in order if egress buffering is used and the out of order packets are received within the window of egress buffering.\n",{"$f":"IF($A29<>\"\",'[2]Step 1 -- Commenter information'!$B$2,\"\")","v":"Jouni Korhonen"},{"$f":"IF($A29<>\"\",'[2]Step 1 -- Commenter information'!$B$3,\"\")","v":"Broadcom Ltd."},null,null,"Yes, this is a hang-over from the old tunneling mapper. I guess when I merged the two mappers I removed the description from agnostic rather than tunneling.\r\n\r\nCovered by previous comment.","2016.11.08, 08:28"]
[29,"TF3","Resolved","Accept","None",null,"Technical","Yes",11,null,6.3,20,"Parameter may also be programmed into RoE Nodes by a controller (a \"god box\"). That mode of operation must also be supported.","OLD:\nParameters are exchanged using OAM TLV packets, see sub-clause 8.1.7. \n\nNEW:\nParameters are either programmed/communicated out of band using some management protocol or exchanged using OAM TLV packets, see sub-clause 8.1.7. ",{"$f":"IF($A30<>\"\",'[2]Step 1 -- Commenter information'!$B$2,\"\")","v":"Jouni Korhonen"},{"$f":"IF($A30<>\"\",'[2]Step 1 -- Commenter information'!$B$3,\"\")","v":"Broadcom Ltd."},null,null,"editorial - yes, better","2016.10.27, 14:38"]
{"$rows_left_out":590}
{"sheet":"Sheet1","index":1,"n_rows":6,"n_cols":2,"rows_kept":6,"cut":false,"hidden":false,"merged":[]}
["Incomplete",{"$f":"COUNTIF(D1.2!C$3:C$300,Sheet1!A1)","v":22}]
["Postponed",{"$f":"COUNTIF(D1.2!C$3:C$300,Sheet1!A2)","v":9}]
["Withdrawn",{"$f":"COUNTIF(D1.2!C$3:C$300,Sheet1!A3)","v":22}]
["Proposed",{"$f":"COUNTIF(D1.2!C$3:C$300,Sheet1!A4)","v":7}]
["Resolved",{"$f":"COUNTIF(D1.2!C$3:C$300,Sheet1!A5)","v":215}]
["Withdrawn",{"$f":"COUNTIF(D1.2!C$3:C$300,Sheet1!A6)","v":22}]

{"sheet":"Stats","index":2,"n_rows":37,"n_cols":7,"rows_kept":37,"cut":false,"hidden":false,"merged":[]}
[null,"E","ER","T","TR",null,"Totals"]
[0,{"$f":"get_Stats($A2,B$1)","v":0},0,0,0,{"$f":"get_TF_assignment(A2)","v":"WG"},{"$f":"SUM(B2:F2)","v":0}]
[99,0,0,0,0,"WG",{"$f":"SUM(B3:F3)","v":0}]
[1,{"$f":"get_Stats($A4,B$1)","v":0},{"$f":"get_Stats($A4,C$1)","v":0},0,0,{"$f":"get_TF_assignment(A4)","v":"WG"},{"$f":"SUM(B4:E4)","v":0}]
[2,0,0,0,0,"WG",0]
[3,0,0,0,0,"WG",0]
[4,0,0,0,0,"WG",0]
["4A",0,0,0,0,"TF5",{"$f":"SUM(B8:E8)","v":0}]
["4B",0,0,0,0,"TF5",0]
["4C",0,0,0,0,"TF5",0]
[5,0,0,0,0,"WG",0]
["5A",0,0,0,0,"WG",0]
[6,0,0,0,0,"TF1",0]
[7,0,0,0,0,"TF1",0]
["7A",0,0,0,0,"TF1",0]
[8,0,0,0,0,"TF2",0]
[9,0,0,0,0,"TF3",0]
["9A",0,0,0,0,"TF3",0]
["9B",0,0,0,0,"TF3",0]
[10,0,0,0,0,"TF3",0]
["10A",0,0,0,0,"TF3",0]
[11,0,0,0,0,"TF4",0]
[12,0,0,0,0,"TF4",0]
[13,0,0,0,0,"TF4",0]
["13A",0,0,0,0,"TF4",0]
[14,0,0,0,0,"TF4",0]
[null,null,null,null,null,null,{"$f":"SUM(G2:G26)","v":0}]
["Totals",{"$f":"SUM(B2:B26)","v":0},{"$f":"SUM(C2:C26)","v":0},{"$f":"SUM(D2:D26)","v":0},{"$f":"SUM(E2:E26)","v":0},{"$f":"SUM(B28:E28)","v":0},{"$f":"IF(F28=G27,\"OK\",\"ERROR\")","v":"OK"}]
[]
["TFs","WG","TF1","TF2","TF3","TF4","TF5"]
{"$rows_left_out":8}
{"sheet":"Status change flow","index":4,"n_rows":6,"n_cols":2,"rows_kept":6,"cut":false,"hidden":false,"merged":[[1,0,1,1]]}
[]
["Legend"]
[]
["CS","Comment Status"]
["CC","Commenter Satisfaction"]
["RS","Response Status"]

{"sheet":"Parameters","index":5,"n_rows":50,"n_cols":8,"rows_kept":50,"cut":false,"hidden":true,"merged":[]}
[10000,"TF1","New","AIP","Satisfied","Technical","Yes",50]
[null,"TF2","Incomplete","Accept","Unsatisfied","Editorial","No",49]
[null,"TF3","Postponed","Reject",null,null,null,48]
[null,"TF4","Resolved",null,null,null,null,47]
[null,"WG","Withdrawn",null,null,null,null,46]
[null,null,"Proposed",null,null,null,null,45]
[null,null,"Closed",null,null,null,null,44]
[null,null,null,null,null,null,null,43]
[null,null,null,null,null,null,null,42]
[null,null,null,null,null,null,null,41]
[null,null,null,null,null,null,null,40]
[null,null,null,null,null,null,null,39]
[null,null,null,null,null,null,null,38]
[null,null,null,null,null,null,null,37]
[null,null,null,null,null,null,null,36]
[null,null,null,null,null,null,null,35]
[null,null,null,null,null,null,null,34]
[null,null,null,null,null,null,null,33]
[null,null,null,null,null,null,null,32]
[null,null,null,null,null,null,null,31]
[null,null,null,null,null,null,null,30]
[null,null,null,null,null,null,null,29]
[null,null,null,null,null,null,null,28]
[null,null,null,null,null,null,null,27]
[null,null,null,null,null,null,null,26]
[null,null,null,null,null,null,null,25]
[null,null,null,null,null,null,null,24]
[null,null,null,null,null,null,null,23]
[null,null,null,null,null,null,null,22]
[null,null,null,null,null,null,null,21]
{"$rows_left_out":21}
{"sheet":"Values","index":6,"n_rows":25,"n_cols":7,"rows_kept":25,"cut":false,"hidden":true,"merged":[]}
["None","None","WG","None","Technical","Yes",0]
["New","AIP","TF1","Satisfied","Editorial","No",1]
["Proposed","Accept","TF2","Unsatisfied",null,null,2]
["Postponed","Reject","TF3","TBD",null,null,3]
["Incomplete",null,"TF4",null,null,null,4]
["Withdrawn",null,"TF5",null,null,null,"4A"]
["Resolved",null,null,null,null,null,"4B"]
[null,null,null,null,null,null,"4C"]
[null,null,null,null,null,null,5]
[null,null,null,null,null,null,"5A"]
[null,null,null,null,null,null,6]
[null,null,null,null,null,null,7]
[null,null,null,null,null,null,"7A"]
[null,null,null,null,null,null,8]
[null,null,null,null,null,null,9]
[null,null,null,null,null,null,"9A"]
[null,null,null,null,null,null,"9B"]
[null,null,null,null,null,null,10]
[null,null,null,null,null,null,"10A"]
[null,null,null,null,null,null,11]
[null,null,null,null,null,null,12]
[null,null,null,null,null,null,13]
[null,null,null,null,null,null,"13A"]
[null,null,null,null,null,null,14]
[null,null,null,null,null,null,99]